{"text_format":"1","workbook":"xlsx","n_sheets":2,"sheets":["Processed_meteo_data","Sheet1"],"not_rendered":{"charts":0,"images":0,"macros":1,"external_links":0,"defined_names":1,"comments":0,"pivot_tables":0},"unopened":[],"bounds":{"document_bytes":16777216,"sheet_cells":100000,"rows_first":2000,"rows_last":500,"rows_between":2000,"halvings":0,"cell_chars":16384,"cell_head_chars":4096},"cells_cut":0,"cells_raw":0,"read":"whole","date_system":"1900"}

{"sheet":"Processed_meteo_data","index":0,"n_rows":373,"n_cols":16,"rows_kept":373,"cut":false,"hidden":false,"merged":[[1,6,1,10],[1,11,1,15],[1,1,1,3],[16,5,16,7],[16,9,16,11]]}
[34,null,null,null,null,null,null,null,null,null,"NEKE VRSTE FOR !!!!!!!!!!!!!!"]
[29,"Daily average",null,null,null,null,"Precipitation (mm)",null,null,null,null,"Air_Temperature (°C)"]
[{"$f":"A1+A2","v":63},"Date","Precipitation (mm)","Air_Temperature (°C)",null,"Month","P_MIN_DATE","P_MIN_VALUE","P_MAX_DATE","P_MAX_VALUE","P_SUM_VALUE","AT_MIN_DATE","AT_MIN_VALUE","AT_MAX_DATE","AT_MAX_VALUE","AT_AVG_VALUE"]
[{"$f":"IF(B4<>\"\",MONTH(B4),\"\")","v":1},{"$f":"Sheet1!B4","v":"2016-01-01"},{"$f":"IF(Sheet1!E4=-1,0,Sheet1!E4)","v":0},{"$f":"Sheet1!F4","v":-3.3},null,1,{"$f":"INDEX(B4:B34,MATCH(H4,C4:C34,0))","v":"2016-01-26"},{"$f":"IF(MONTH(B$4:B$400)=$F4,IFERROR(SMALL(C$4:C$400,COUNTIF(C$4:C$400,\"<\"&0.1)+1),0),\"\")","v":0.1},{"$f":"INDEX(B4:B34,MATCH(MAX(C4:C34),C4:C34,0))","v":"2016-01-12"},{"$f":"MAX(IF(A$4:A$380 = F4,C$4:C$380))","v":39},{"$f":"SUMIF(A$1:A$380,F4,C$1:C$380)","v":62.800000000000004},{"$f":"INDEX(Sheet1!B4:B34,MATCH(MIN(Sheet1!D4:D34),Sheet1!D4:D34,0))","v":"2016-01-05"},{"$f":"MIN(Sheet1!D4:D34)","v":-14.2},{"$f":"INDEX(Sheet1!B4:B34,MATCH(MAX(Sheet1!C4:C34),Sheet1!C4:C34,0))","v":"2016-01-11"},{"$f":"MAX(Sheet1!C4:C34)","v":16.7},{"$f":"AVERAGE(D4:D34)","v":-8.3870967741935476E-2}]
[{"$f":"IF(B5<>\"\",MONTH(B5),\"\")","v":1},{"$f":"Sheet1!B5","v":"2016-01-02"},{"$f":"IF(Sheet1!E5=-1,0,Sheet1!E5)","v":0},{"$f":"Sheet1!F5","v":-3.2},null,2,{"$f":"INDEX(B35:B63,MATCH(H5,C35:C63,0))","v":{"$error":"#N/A"}},{"$f":"IF(MONTH(B$4:B$400)=$F5,IFERROR(SMALL(C$4:C$400,COUNTIF(C$4:C$400,\"<\"&0.1)+1),0),\"\")","v":""},{"$f":"INDEX(B35:B63,MATCH(MAX(C35:C63),C35:C63,0))","v":"2016-02-16"},{"$f":"MAX(IF(A$4:A$380 = F5,C$4:C$380))","v":0},172.29999999999998,{"$f":"INDEX(Sheet1!B35:B63,MATCH(MIN(Sheet1!D35:D63),Sheet1!D35:D63,0))","v":"2016-02-06"},{"$f":"MIN(Sheet1!D35:D63)","v":-4.0999999999999996},{"$f":"INDEX(Sheet1!B35:B63,MATCH(MAX(Sheet1!C35:C63),Sheet1!C35:C63,0))","v":"2016-02-01"},{"$f":"MAX(Sheet1!C35:C63)","v":16.3},{"$f":"AVERAGE(D35:D63)","v":5.224137931034484}]
[1,{"$f":"Sheet1!B6","v":"2016-01-03"},{"$f":"IF(Sheet1!E6=-1,0,Sheet1!E6)","v":6.6},{"$f":"Sheet1!F6","v":-5},null,3,{"$f":"INDEX(B64:B94,MATCH(H6,C64:C94,0))","v":{"$error":"#N/A"}},{"$f":"IF(MONTH(B$4:B$400)=$F6,IFERROR(SMALL(C$4:C$400,COUNTIF(C$4:C$400,\"<\"&0.1)+1),0),\"\")","v":""},{"$f":"INDEX(B64:B94,MATCH(MAX(C64:C94),C64:C94,0))","v":"2016-03-04"},{"$f":"MAXIFs(C4:C$380,A4:A380,F6)","v":{"$error":"#NAME?"}},{"$f":"SUMIF(A$1:A$380,F6,C$1:C$380)","v":59.6},{"$f":"INDEX(Sheet1!B64:B94,MATCH(MIN(Sheet1!D64:D94),Sheet1!D64:D94,0))","v":"2016-03-25"},{"$f":"MIN(Sheet1!D64:D94)","v":-4.0999999999999996},{"$f":"INDEX(Sheet1!B64:B94,MATCH(MAX(Sheet1!C64:C94),Sheet1!C64:C94,0))","v":"2016-03-31"},{"$f":"MAX(Sheet1!C64:C94)","v":20.6},{"$f":"AVERAGE(D64:D94)","v":6.4903225806451603}]
[1,{"$f":"Sheet1!B7","v":"2016-01-04"},{"$f":"IF(Sheet1!E7=-1,0,Sheet1!E7)","v":1.2},{"$f":"Sheet1!F7","v":-6.5},null,4,{"$f":"INDEX(B95:B124,MATCH(H7,C95:C124,0))","v":{"$error":"#N/A"}},"",{"$f":"INDEX(B95:B124,MATCH(MAX(C95:C124),C95:C124,0))","v":"2016-04-28"},{"$f":"MAX(C95:C124)","v":30.8},{"$f":"SUMIF(A$1:A$380,F7,C$1:C$380)","v":68.3},{"$f":"INDEX(Sheet1!B95:B124,MATCH(MIN(Sheet1!D95:D124),Sheet1!D95:D124,0))","v":"2016-04-26"},{"$f":"MIN(Sheet1!D95:D124)","v":-3.1},{"$f":"INDEX(Sheet1!B95:B124,MATCH(MAX(Sheet1!C95:C124),Sheet1!C95:C124,0))","v":"2016-04-06"},{"$f":"MAX(Sheet1!C95:C124)","v":25.1},{"$f":"AVERAGE(D95:D124)","v":11.356666666666671}]
[1,{"$f":"Sheet1!B8","v":"2016-01-05"},{"$f":"IF(Sheet1!E8=-1,0,Sheet1!E8)","v":1.2},{"$f":"Sheet1!F8","v":-6.2},null,5,{"$f":"INDEX(B125:B155,MATCH(H8,C125:C155,0))","v":{"$error":"#N/A"}},"",{"$f":"INDEX(B125:B155,MATCH(MAX(C125:C155),C125:C155,0))","v":"2016-05-02"},{"$f":"MAX(C125:C155)","v":25.5},128.99999999999997,{"$f":"INDEX(Sheet1!B125:B155,MATCH(MIN(Sheet1!D125:D155),Sheet1!D125:D155,0))","v":"2016-05-17"},{"$f":"MIN(Sheet1!D125:D155)","v":3.1},{"$f":"INDEX(Sheet1!B125:B155,MATCH(MAX(Sheet1!C125:C155),Sheet1!C125:C155,0))","v":"2016-05-28"},{"$f":"MAX(Sheet1!C125:C155)","v":29.4},{"$f":"AVERAGE(D125:D155)","v":14.558064516129029}]
[1,{"$f":"Sheet1!B9","v":"2016-01-06"},{"$f":"IF(Sheet1!E9=-1,0,Sheet1!E9)","v":0.4},{"$f":"Sheet1!F9","v":-2},null,6,{"$f":"INDEX(B156:B185,MATCH(H9,C156:C185,0))","v":{"$error":"#N/A"}},"",{"$f":"INDEX(B156:B185,MATCH(MAX(C156:C185),C156:C185,0))","v":"2016-06-15"},{"$f":"MAX(C156:C185)","v":27.3},{"$f":"SUMIF(A$1:A$380,F9,C$1:C$380)","v":120.50000000000001},{"$f":"INDEX(Sheet1!B156:B185,MATCH(MIN(Sheet1!D156:D185),Sheet1!D156:D185,0))","v":"2016-06-04"},{"$f":"MIN(Sheet1!D156:D185)","v":10.1},{"$f":"INDEX(Sheet1!B156:B185,MATCH(MAX(Sheet1!C156:C185),Sheet1!C156:C185,0))","v":"2016-06-24"},{"$f":"MAX(Sheet1!C156:C185)","v":32.9},{"$f":"AVERAGE(D156:D185)","v":18.709999999999997}]
[1,{"$f":"Sheet1!B10","v":"2016-01-07"},{"$f":"IF(Sheet1!E10=-1,0,Sheet1!E10)","v":1},{"$f":"Sheet1!F10","v":-1.8},null,7,{"$f":"INDEX(B186:B216,MATCH(H10,C186:C216,0))","v":{"$error":"#N/A"}},"",{"$f":"INDEX(B186:B216,MATCH(MAX(C186:C216),C186:C216,0))","v":"2016-07-14"},{"$f":"MAX(C186:C216)","v":20.9},66.8,{"$f":"INDEX(Sheet1!B186:B216,MATCH(MIN(Sheet1!D186:D216),Sheet1!D186:D216,0))","v":"2016-07-05"},{"$f":"MIN(Sheet1!D186:D216)","v":11.2},{"$f":"INDEX(Sheet1!B186:B216,MATCH(MAX(Sheet1!C186:C216),Sheet1!C186:C216,0))","v":"2016-07-12"},{"$f":"MAX(Sheet1!C186:C216)","v":33.4},{"$f":"AVERAGE(D186:D216)","v":21.529032258064518}]
[1,{"$f":"Sheet1!B11","v":"2016-01-08"},{"$f":"IF(Sheet1!E11=-1,0,Sheet1!E11)","v":0},{"$f":"Sheet1!F11","v":-0.3},null,8,{"$f":"INDEX(B217:B247,MATCH(H11,C217:C247,0))","v":{"$error":"#N/A"}},"",{"$f":"INDEX(B217:B247,MATCH(MAX(C217:C247),C217:C247,0))","v":"2016-08-01"},{"$f":"MAX(C217:C247)","v":39},{"$f":"SUMIF(A$1:A$380,F11,C$1:C$380)","v":172.69999999999996},{"$f":"INDEX(Sheet1!B217:B247,MATCH(MIN(Sheet1!D217:D247),Sheet1!D217:D247,0))","v":"2016-08-12"},{"$f":"MIN(Sheet1!D217:D247)","v":5.9},{"$f":"INDEX(Sheet1!B217:B247,MATCH(MAX(Sheet1!C217:C247),Sheet1!C217:C247,0))","v":"2016-08-05"},{"$f":"MAX(Sheet1!C217:C247)","v":30.7},{"$f":"AVERAGE(D217:D247)","v":18.796774193548391}]
[1,{"$f":"Sheet1!B12","v":"2016-01-09"},{"$f":"IF(Sheet1!E12=-1,0,Sheet1!E12)","v":1.3},{"$f":"Sheet1!F12","v":1.4},null,9,{"$f":"INDEX(B248:B277,MATCH(H12,C248:C277,0))","v":"2016-09-02"},{"$f":"IFERROR(SMALL(C248:C277,COUNTIF(C248:C277,\"<\"&0.1)+1),0)","v":0.1},{"$f":"INDEX(B248:B277,MATCH(MAX(C248:C277),C248:C277,0))","v":"2016-09-17"},{"$f":"MAX(C248:C277)","v":18.3},40.5,{"$f":"INDEX(Sheet1!B248:B277,MATCH(MIN(Sheet1!D248:D277),Sheet1!D248:D277,0))","v":"2016-09-22"},{"$f":"MIN(Sheet1!D248:D277)","v":4.5},{"$f":"INDEX(Sheet1!B248:B277,MATCH(MAX(Sheet1!C248:C277),Sheet1!C248:C277,0))","v":"2016-09-04"},{"$f":"MAX(Sheet1!C248:C277)","v":29.7},{"$f":"AVERAGE(D248:D277)","v":16.466666666666665}]
[1,{"$f":"Sheet1!B13","v":"2016-01-10"},{"$f":"IF(Sheet1!E13=-1,0,Sheet1!E13)","v":12.9},{"$f":"Sheet1!F13","v":6.7},null,10,{"$f":"INDEX(B278:B308,MATCH(H13,C278:C308,0))","v":"2016-10-24"},{"$f":"IFERROR(SMALL(C278:C308,COUNTIF(C278:C308,\"<\"&0.1)+1),0)","v":0.1},{"$f":"INDEX(B278:B308,MATCH(MAX(C278:C308),C278:C308,0))","v":"2016-10-26"},{"$f":"MAX(C278:C308)","v":28.6},103.00000000000001,{"$f":"INDEX(Sheet1!B278:B308,MATCH(MIN(Sheet1!D278:D308),Sheet1!D278:D308,0))","v":"2016-10-06"},{"$f":"MIN(Sheet1!D278:D308)","v":-1.8},{"$f":"INDEX(Sheet1!B278:B308,MATCH(MAX(Sheet1!C278:C308),Sheet1!C278:C308,0))","v":"2016-10-01"},{"$f":"MAX(Sheet1!C278:C308)","v":24.1},{"$f":"AVERAGE(D278:D308)","v":9.3806451612903228}]
[1,{"$f":"Sheet1!B14","v":"2016-01-11"},{"$f":"IF(Sheet1!E14=-1,0,Sheet1!E14)","v":0.4},{"$f":"Sheet1!F14","v":10.4},null,11,{"$f":"INDEX(B309:B338,MATCH(H14,C309:C338,0))","v":"2016-11-10"},{"$f":"IFERROR(SMALL(C309:C338,COUNTIF(C309:C338,\"<\"&0.1)+1),0)","v":0.1},{"$f":"INDEX(B309:B338,MATCH(MAX(C309:C338),C309:C338,0))","v":"2016-11-07"},{"$f":"MAX(C309:C338)","v":38.1},{"$f":"SUMIF(A$1:A$380,F14,C$1:C$380)","v":142.99999999999997},{"$f":"INDEX(Sheet1!B309:B338,MATCH(MIN(Sheet1!D309:D338),Sheet1!D309:D338,0))","v":"2016-11-30"},{"$f":"MIN(Sheet1!D309:D338)","v":-7.4},{"$f":"INDEX(Sheet1!B309:B338,MATCH(MAX(Sheet1!C309:C338),Sheet1!C309:C338,0))","v":"2016-11-24"},{"$f":"MAX(Sheet1!C309:C338)","v":18.2},{"$f":"AVERAGE(D309:D338)","v":5.9733333333333327}]
[1,{"$f":"Sheet1!B15","v":"2016-01-12"},{"$f":"IF(Sheet1!E15=-1,0,Sheet1!E15)","v":36.700000000000003},{"$f":"Sheet1!F15","v":3.3},null,12,{"$f":"INDEX(B339:B369,MATCH(H15,C339:C369,0))","v":"2016-12-27"},{"$f":"IFERROR(SMALL(C339:C369,COUNTIF(C339:C369,\"<\"&0.1)+1),0)","v":0.1},{"$f":"INDEX(B339:B369,MATCH(MAX(C339:C369),C339:C369,0))","v":"2016-12-29"},{"$f":"MAX(C339:C369)","v":0.2},0.30000000000000004,{"$f":"INDEX(Sheet1!B339:B369,MATCH(MIN(Sheet1!D339:D369),Sheet1!D339:D369,0))","v":"2016-12-31"},{"$f":"MIN(Sheet1!D339:D369)","v":-10.6},{"$f":"INDEX(Sheet1!B339:B369,MATCH(MAX(Sheet1!C339:C369),Sheet1!C339:C369,0))","v":"2016-12-12"},{"$f":"MAX(Sheet1!C339:C369)","v":12.6},{"$f":"AVERAGE(D339:D369)","v":-0.92258064516129024}]
[1,{"$f":"Sheet1!B16","v":"2016-01-13"},{"$f":"IF(Sheet1!E16=-1,0,Sheet1!E16)","v":0},{"$f":"Sheet1!F16","v":2.2000000000000002}]
[1,{"$f":"Sheet1!B17","v":"2016-01-14"},{"$f":"IF(Sheet1!E17=-1,0,Sheet1!E17)","v":0},{"$f":"Sheet1!F17","v":0.9},null,"Precipitation (mm)",null,null,null,"Air_Temperature (°C)"]
[1,{"$f":"Sheet1!B18","v":"2016-01-15"},{"$f":"IF(Sheet1!E18=-1,0,Sheet1!E18)","v":0.9},{"$f":"Sheet1!F18","v":0.6},null,"P_YEARLY","P_DATE","P_VALUE",null,"AT_YEARLY","AT_DATE","AT_VALUE"]
[1,{"$f":"Sheet1!B19","v":"2016-01-16"},{"$f":"IF(Sheet1!E19=-1,0,Sheet1!E19)","v":0},{"$f":"Sheet1!F19","v":-1},null,"MIN",{"$f":"INDEX(G4:G15,MATCH(MIN(H4:H15),H4:H15,0))","v":"2016-01-26"},{"$f":"MIN(H4:H15)","v":0.1},null,"MIN",{"$f":"INDEX(L4:L15,MATCH(MIN(M4:M15),M4:M15,0))","v":"2016-01-05"},{"$f":"MIN(M4:M15)","v":-14.2}]
[1,{"$f":"Sheet1!B20","v":"2016-01-17"},{"$f":"IF(Sheet1!E20=-1,0,Sheet1!E20)","v":0},{"$f":"Sheet1!F20","v":-1.6},null,"MAX",{"$f":"INDEX(I4:I15,MATCH(MAX(J4:J15),J4:J15,0))","v":{"$error":"#NAME?"}},{"$f":"MAX(J4:J15)","v":{"$error":"#NAME?"}},null,"MAX",{"$f":"INDEX(N4:N15,MATCH(MAX(O4:O15),O4:O15,0))","v":"2016-07-12"},{"$f":"MAX(O4:O15)","v":33.4}]
[1,{"$f":"Sheet1!B21","v":"2016-01-18"},{"$f":"IF(Sheet1!E21=-1,0,Sheet1!E21)","v":0},{"$f":"Sheet1!F21","v":-5.3},null,"SUM",{"$f":"YEAR(B4)","v":2016},{"$f":"SUM(K4:K15)","v":1138.7999999999997},null,"AVG",{"$f":"YEAR(B4)","v":2016},{"$f":"AVERAGE(P4:P15)","v":10.623265974539612}]
[1,{"$f":"Sheet1!B22","v":"2016-01-19"},{"$f":"IF(Sheet1!E22=-1,0,Sheet1!E22)","v":0},{"$f":"Sheet1!F22","v":-5.9}]
[1,{"$f":"Sheet1!B23","v":"2016-01-20"},{"$f":"IF(Sheet1!E23=-1,0,Sheet1!E23)","v":0},{"$f":"Sheet1!F23","v":-4.0999999999999996}]
[1,{"$f":"Sheet1!B24","v":"2016-01-21"},{"$f":"IF(Sheet1!E24=-1,0,Sheet1!E24)","v":0},{"$f":"Sheet1!F24","v":-3.5},null,"Legend",null,"ALT in F11 vkljucis Visual Basic editor"]
[1,{"$f":"Sheet1!B25","v":"2016-01-22"},{"$f":"IF(Sheet1!E25=-1,0,Sheet1!E25)","v":0},{"$f":"Sheet1!F25","v":-4}]
[1,{"$f":"Sheet1!B26","v":"2016-01-23"},{"$f":"IF(Sheet1!E26=-1,0,Sheet1!E26)","v":0},{"$f":"Sheet1!F26","v":-6.2},null,"Daily"]
[1,{"$f":"Sheet1!B27","v":"2016-01-24"},{"$f":"IF(Sheet1!E27=-1,0,Sheet1!E27)","v":0},{"$f":"Sheet1!F27","v":-2.4},null,"Monthly",null,null,{"$f":"MONTH(B4)","v":1},null,null,null,"tipi dim v visual basic in excel ....."]
[1,{"$f":"Sheet1!B28","v":"2016-01-25"},{"$f":"IF(Sheet1!E28=-1,0,Sheet1!E28)","v":0},{"$f":"Sheet1!F28","v":2.5},null,"Yearly",null,null,null,null,null,null,"https://docs.microsoft.com/en-us/dotnet/visual-basic/language-reference/statements/dim-statement"]
[1,{"$f":"Sheet1!B29","v":"2016-01-26"},{"$f":"IF(Sheet1!E29=-1,0,Sheet1!E29)","v":0.1},{"$f":"Sheet1!F29","v":2.6},null,null,null,null,"Spodnjo st izracuna GUMB (klik)"]
[1,{"$f":"Sheet1!B30","v":"2016-01-27"},{"$f":"IF(Sheet1!E30=-1,0,Sheet1!E30)","v":0},{"$f":"Sheet1!F30","v":4.0999999999999996},null,null,null,100,162.89999999999998,"  Dim vso As Double",null,null,"Kako dodadam gumb za izvedbo makroja (slike)"]
[1,{"$f":"Sheet1!B31","v":"2016-01-28"},{"$f":"IF(Sheet1!E31=-1,0,Sheet1!E31)","v":0},{"$f":"Sheet1!F31","v":5.6},null,null,null,100,null,"        vso = 0",null,null,"https://www.youtube.com/watch?v=BecOCSWw1to"]
[1,{"$f":"Sheet1!B32","v":"2016-01-29"},{"$f":"IF(Sheet1!E32=-1,0,Sheet1!E32)","v":0},{"$f":"Sheet1!F32","v":2.8},null,null,null,100,null,"        ",null,null,"Izberem recimo - velja za ta dokument"]
[1,{"$f":"Sheet1!B33","v":"2016-01-30"},{"$f":"IF(Sheet1!E33=-1,0,Sheet1!E33)","v":0},{"$f":"Sheet1!F33","v":7},null,null,null,100,null,"Dim i As Integer",null,null,"List1.ProFirst"]
[1,{"$f":"Sheet1!B34","v":"2016-01-31"},{"$f":"IF(Sheet1!E34=-1,0,Sheet1!E34)","v":0.1},{"$f":"Sheet1!F34","v":9.6},null,2,null,100]
[2,{"$f":"Sheet1!B35","v":"2016-02-01"},{"$f":"IF(Sheet1!E35=-1,0,Sheet1!E35)","v":1},{"$f":"Sheet1!F35","v":7.8},null,2,null,100,null,"For i = 30 To 39"]
[2,{"$f":"Sheet1!B36","v":"2016-02-02"},{"$f":"IF(Sheet1!E36=-1,0,Sheet1!E36)","v":0},{"$f":"Sheet1!F36","v":12.3},null,null,null,100,null,"    Cells(i, 8).Value = 100"]
[2,{"$f":"Sheet1!B37","v":"2016-02-03"},{"$f":"IF(Sheet1!E37=-1,0,Sheet1!E37)","v":0},{"$f":"Sheet1!F37","v":6.1},null,null,null,100,null,"    "]
[2,{"$f":"Sheet1!B38","v":"2016-02-04"},{"$f":"IF(Sheet1!E38=-1,0,Sheet1!E38)","v":14.9},{"$f":"Sheet1!F38","v":3.1},null,null,null,100,null,"   vso = Cells(i, 3).Value + vso"]
[2,{"$f":"Sheet1!B39","v":"2016-02-05"},{"$f":"IF(Sheet1!E39=-1,0,Sheet1!E39)","v":0},{"$f":"Sheet1!F39","v":1.6},null,null,null,100,null,"   "]
[2,{"$f":"Sheet1!B40","v":"2016-02-06"},{"$f":"IF(Sheet1!E40=-1,0,Sheet1!E40)","v":0},{"$f":"Sheet1!F40","v":6.2},null,null,null,100,null,"    "]
[2,{"$f":"Sheet1!B41","v":"2016-02-07"},{"$f":"IF(Sheet1!E41=-1,0,Sheet1!E41)","v":0},{"$f":"Sheet1!F41","v":9.5},null,null,null,100,null,"Next i"]
[2,{"$f":"Sheet1!B42","v":"2016-02-08"},{"$f":"IF(Sheet1!E42=-1,0,Sheet1!E42)","v":0.7},{"$f":"Sheet1!F42","v":9.4},null,null,null,100]
[2,{"$f":"Sheet1!B43","v":"2016-02-09"},{"$f":"IF(Sheet1!E43=-1,0,Sheet1!E43)","v":1.3},{"$f":"Sheet1!F43","v":11},null,null,null,100,null,"Cells(30, 9).Value = vso"]
[2,{"$f":"Sheet1!B44","v":"2016-02-10"},{"$f":"IF(Sheet1!E44=-1,0,Sheet1!E44)","v":17.399999999999999},{"$f":"Sheet1!F44","v":3.2},null,null,null,100]
[2,{"$f":"Sheet1!B45","v":"2016-02-11"},{"$f":"IF(Sheet1!E45=-1,0,Sheet1!E45)","v":5.5},{"$f":"Sheet1!F45","v":2},null,null,null,100]
[2,{"$f":"Sheet1!B46","v":"2016-02-12"},{"$f":"IF(Sheet1!E46=-1,0,Sheet1!E46)","v":0},{"$f":"Sheet1!F46","v":0.2},null,null,null,100]
[2,{"$f":"Sheet1!B47","v":"2016-02-13"},{"$f":"IF(Sheet1!E47=-1,0,Sheet1!E47)","v":18.2},{"$f":"Sheet1!F47","v":2.2999999999999998},null,null,null,100]
[2,{"$f":"Sheet1!B48","v":"2016-02-14"},{"$f":"IF(Sheet1!E48=-1,0,Sheet1!E48)","v":0.7},{"$f":"Sheet1!F48","v":4.8},null,null,null,100]
[2,{"$f":"Sheet1!B49","v":"2016-02-15"},{"$f":"IF(Sheet1!E49=-1,0,Sheet1!E49)","v":12.2},{"$f":"Sheet1!F49","v":3.4},null,null,null,100]
[2,{"$f":"Sheet1!B50","v":"2016-02-16"},{"$f":"IF(Sheet1!E50=-1,0,Sheet1!E50)","v":27.3},{"$f":"Sheet1!F50","v":3.4},null,null,null,100]
[2,{"$f":"Sheet1!B51","v":"2016-02-17"},{"$f":"IF(Sheet1!E51=-1,0,Sheet1!E51)","v":12.3},{"$f":"Sheet1!F51","v":1.1000000000000001},null,null,null,100]
[2,{"$f":"Sheet1!B52","v":"2016-02-18"},{"$f":"IF(Sheet1!E52=-1,0,Sheet1!E52)","v":15.9},{"$f":"Sheet1!F52","v":3.2},null,null,null,100]
[2,{"$f":"Sheet1!B53","v":"2016-02-19"},{"$f":"IF(Sheet1!E53=-1,0,Sheet1!E53)","v":23.5},{"$f":"Sheet1!F53","v":4.2},null,null,null,100]
[2,{"$f":"Sheet1!B54","v":"2016-02-20"},{"$f":"IF(Sheet1!E54=-1,0,Sheet1!E54)","v":9.6},{"$f":"Sheet1!F54","v":2.9},null,null,null,100]
[2,{"$f":"Sheet1!B55","v":"2016-02-21"},{"$f":"IF(Sheet1!E55=-1,0,Sheet1!E55)","v":0},{"$f":"Sheet1!F55","v":7.9},null,null,null,100]
[2,{"$f":"Sheet1!B56","v":"2016-02-22"},{"$f":"IF(Sheet1!E56=-1,0,Sheet1!E56)","v":0},{"$f":"Sheet1!F56","v":11.4},null,null,null,100]
[2,{"$f":"Sheet1!B57","v":"2016-02-23"},{"$f":"IF(Sheet1!E57=-1,0,Sheet1!E57)","v":0.2},{"$f":"Sheet1!F57","v":9.6999999999999993},null,null,null,100]
[2,{"$f":"Sheet1!B58","v":"2016-02-24"},{"$f":"IF(Sheet1!E58=-1,0,Sheet1!E58)","v":1.5},{"$f":"Sheet1!F58","v":3.7},null,null,null,100]
[2,{"$f":"Sheet1!B59","v":"2016-02-25"},{"$f":"IF(Sheet1!E59=-1,0,Sheet1!E59)","v":0},{"$f":"Sheet1!F59","v":5.6},null,null,null,100]
[2,{"$f":"Sheet1!B60","v":"2016-02-26"},{"$f":"IF(Sheet1!E60=-1,0,Sheet1!E60)","v":0.6},{"$f":"Sheet1!F60","v":2},null,null,null,100]
[2,{"$f":"Sheet1!B61","v":"2016-02-27"},{"$f":"IF(Sheet1!E61=-1,0,Sheet1!E61)","v":0.2},{"$f":"Sheet1!F61","v":2.2000000000000002}]
[2,{"$f":"Sheet1!B62","v":"2016-02-28"},{"$f":"IF(Sheet1!E62=-1,0,Sheet1!E62)","v":0.3},{"$f":"Sheet1!F62","v":4.8}]
[2,{"$f":"Sheet1!B63","v":"2016-02-29"},{"$f":"IF(Sheet1!E63=-1,0,Sheet1!E63)","v":9},{"$f":"Sheet1!F63","v":6.5}]
[3,{"$f":"Sheet1!B64","v":"2016-03-01"},{"$f":"IF(Sheet1!E64=-1,0,Sheet1!E64)","v":7.9},{"$f":"Sheet1!F64","v":5.9}]
[3,{"$f":"Sheet1!B65","v":"2016-03-02"},{"$f":"IF(Sheet1!E65=-1,0,Sheet1!E65)","v":0},{"$f":"Sheet1!F65","v":5}]
[3,{"$f":"Sheet1!B66","v":"2016-03-03"},{"$f":"IF(Sheet1!E66=-1,0,Sheet1!E66)","v":10.9},{"$f":"Sheet1!F66","v":2.2000000000000002}]
[3,{"$f":"Sheet1!B67","v":"2016-03-04"},{"$f":"IF(Sheet1!E67=-1,0,Sheet1!E67)","v":19.100000000000001},{"$f":"Sheet1!F67","v":4.5999999999999996}]
[3,{"$f":"Sheet1!B68","v":"2016-03-05"},{"$f":"IF(Sheet1!E68=-1,0,Sheet1!E68)","v":0},{"$f":"Sheet1!F68","v":9.1}]
[{"$f":"IF(B69<>\"\",MONTH(B69),\"\")","v":3},{"$f":"Sheet1!B69","v":"2016-03-06"},{"$f":"IF(Sheet1!E69=-1,0,Sheet1!E69)","v":4.8},{"$f":"Sheet1!F69","v":6.5}]
[3,{"$f":"Sheet1!B70","v":"2016-03-07"},{"$f":"IF(Sheet1!E70=-1,0,Sheet1!E70)","v":8.5},{"$f":"Sheet1!F70","v":2.4}]
[3,{"$f":"Sheet1!B71","v":"2016-03-08"},{"$f":"IF(Sheet1!E71=-1,0,Sheet1!E71)","v":4.8},{"$f":"Sheet1!F71","v":4.9000000000000004}]
[3,{"$f":"Sheet1!B72","v":"2016-03-09"},{"$f":"IF(Sheet1!E72=-1,0,Sheet1!E72)","v":0},{"$f":"Sheet1!F72","v":4.5}]
[3,{"$f":"Sheet1!B73","v":"2016-03-10"},{"$f":"IF(Sheet1!E73=-1,0,Sheet1!E73)","v":0},{"$f":"Sheet1!F73","v":6.2}]
[3,{"$f":"Sheet1!B74","v":"2016-03-11"},{"$f":"IF(Sheet1!E74=-1,0,Sheet1!E74)","v":0.3},{"$f":"Sheet1!F74","v":7}]
[3,{"$f":"Sheet1!B75","v":"2016-03-12"},{"$f":"IF(Sheet1!E75=-1,0,Sheet1!E75)","v":1},{"$f":"Sheet1!F75","v":6.8}]
[3,{"$f":"Sheet1!B76","v":"2016-03-13"},{"$f":"IF(Sheet1!E76=-1,0,Sheet1!E76)","v":0},{"$f":"Sheet1!F76","v":5.4}]
[3,{"$f":"Sheet1!B77","v":"2016-03-14"},{"$f":"IF(Sheet1!E77=-1,0,Sheet1!E77)","v":0.1},{"$f":"Sheet1!F77","v":4.3}]
[3,{"$f":"Sheet1!B78","v":"2016-03-15"},{"$f":"IF(Sheet1!E78=-1,0,Sheet1!E78)","v":0},{"$f":"Sheet1!F78","v":1.3}]
[3,{"$f":"Sheet1!B79","v":"2016-03-16"},{"$f":"IF(Sheet1!E79=-1,0,Sheet1!E79)","v":1.2},{"$f":"Sheet1!F79","v":2.9}]
[3,{"$f":"Sheet1!B80","v":"2016-03-17"},{"$f":"IF(Sheet1!E80=-1,0,Sheet1!E80)","v":0},{"$f":"Sheet1!F80","v":3.3}]
{"$rows_left_out":294}
{"sheet":"Sheet1","index":1,"n_rows":376,"n_cols":12,"rows_kept":376,"cut":false,"hidden":false,"merged":[]}
[]
[]
[null,"Date","MAX_T","MIN_T","Padavine","pov_dnev_T",null,"delta - iskanje napake min > max TEM",null,null,null,"POV_DNEVNA<T_MIN:in >T_MAX"]
[null,"2016-01-01",1.5,-6.6,-1,-3.3,null,{"$f":"IF(C4-D4<0, \"MINT > MAXT --> NAPAKA!!!!\",\"\")","v":""},null,null,null,{"$f":"IF(AND(F4>D4,F4<C4),\"\",\"NAPAKA. KER NE VELJA TMIN<TPOV<TMAX\")","v":""}]
[null,"2016-01-02",-0.9,-8.3000000000000007,-1,-3.2,null,"",null,null,null,{"$f":"IF(AND(F5>D5,F5<C5),\"\",\"NAPAKA. KER NE VELJA TMIN<TPOV<TMAX\")","v":""}]
[null,"2016-01-03",-1.6,-5.3,6.6,-5,null,"",null,null,null,""]
[null,"2016-01-04",-4.0999999999999996,-9.6,1.2,-6.5,null,"",null,null,null,""]
[null,"2016-01-05",-2.6,-14.2,1.2,-6.2,null,"",null,null,null,""]
[null,"2016-01-06",-0.9,-3.4,0.4,-2,null,"",null,null,null,""]
[null,"2016-01-07",4.4000000000000004,-8,1,-1.8,null,"",null,null,null,""]
[null,"2016-01-08",3.5,-7.6,-1,-0.3,null,"",null,null,null,""]
[null,"2016-01-09",2,0.4,1.3,1.4,null,"",null,null,null,""]
[null,"2016-01-10",11.2,0.8,12.9,6.7,null,"",null,null,null,""]
[null,"2016-01-11",16.7,7.3,0.4,10.4,null,"",null,null,null,""]
[null,"2016-01-12",11.2,0,36.700000000000003,3.3,null,"",null,null,null,""]
[null,"2016-01-13",9.6,-1.9,-1,2.2000000000000002,null,"",null,null,null,""]
[null,"2016-01-14",3.7,-4.7,-1,0.9,null,"",null,null,null,""]
[null,"2016-01-15",5.3,-2.2999999999999998,0.9,0.6,null,"",null,null,null,""]
[null,"2016-01-16",4.0999999999999996,-6.1,-1,-1,null,"",null,null,null,""]
[null,"2016-01-17",3.8,-7.2,-1,-1.6,null,"",null,null,null,""]
[null,"2016-01-18",0.3,-8.3000000000000007,-1,-5.3,null,"",null,null,null,""]
[null,"2016-01-19",-0.4,-10.6,-1,-5.9,null,"",null,null,null,""]
[null,"2016-01-20",2.1,-9.1999999999999993,-1,-4.0999999999999996,null,"",null,null,null,""]
[null,"2016-01-21",3.4,-9.6,-1,-3.5,null,"",null,null,null,""]
[null,"2016-01-22",1.7,-7,-1,-4,null,"",null,null,null,""]
[null,"2016-01-23",-0.9,-10.5,-1,-6.2,null,"",null,null,null,""]
[null,"2016-01-24",5,-10.3,-1,-2.4,null,"",null,null,null,""]
[null,"2016-01-25",11.2,-3,-1,2.5,null,"",null,null,null,""]
[null,"2016-01-26",14.4,-4.0999999999999996,0.1,2.6,null,"",null,null,null,""]
[null,"2016-01-27",15.6,-4.2,-1,4.0999999999999996,null,"",null,null,null,""]
[null,"2016-01-28",14.6,1,-1,5.6,null,"",null,null,null,""]
[null,"2016-01-29",14.2,-2.9,-1,2.8,null,"",null,null,null,""]
[null,"2016-01-30",11.3,-3.5,-1,7,null,"",null,null,null,""]
[null,"2016-01-31",11.7,7.5,0.1,9.6,null,"",null,null,null,""]
[null,"2016-02-01",16.3,1.7,1,7.8,null,"",null,null,null,""]
[null,"2016-02-02",14.4,5.7,-1,12.3,null,"",null,null,null,""]
[null,"2016-02-03",12.9,2.6,-1,6.1,null,"",null,null,null,""]
[null,"2016-02-04",9.6999999999999993,-0.1,14.9,3.1,null,"",null,null,null,""]
[null,"2016-02-05",9.9,-2.9,-1,1.6,null,"",null,null,null,""]
[null,"2016-02-06",12.6,-4.0999999999999996,-1,6.2,null,"",null,null,null,""]
[null,"2016-02-07",11.1,6.7,-1,9.5,null,"",null,null,null,""]
[null,"2016-02-08",13.7,4.9000000000000004,0.7,9.4,null,"",null,null,null,""]
[null,"2016-02-09",13.8,8.9,1.3,11,null,"",null,null,null,""]
[null,"2016-02-10",11,0.3,17.399999999999999,3.2,null,"",null,null,null,""]
[null,"2016-02-11",10.7,-2.2999999999999998,5.5,2,null,"",null,null,null,""]
[null,"2016-02-12",1.5,-3.4,-1,0.2,null,"",null,null,null,""]
[null,"2016-02-13",8.4,-0.1,18.2,2.2999999999999998,null,"",null,null,null,""]
[null,"2016-02-14",7.8,1.3,0.7,4.8,null,"",null,null,null,""]
[null,"2016-02-15",5.7,1,12.2,3.4,null,"",null,null,null,""]
[null,"2016-02-16",5.6,1.9,27.3,3.4,null,"",null,null,null,""]
[null,"2016-02-17",3.2,0,12.3,1.1000000000000001,null,"",null,null,null,""]
[null,"2016-02-18",3.7,1.1000000000000001,15.9,3.2,null,"",null,null,null,""]
[null,"2016-02-19",5.7,3.3,23.5,4.2,null,"",null,null,null,""]
[null,"2016-02-20",7.6,1.5,9.6,2.9,null,"",null,null,null,""]
[null,"2016-02-21",12.5,1,-1,7.9,null,"",null,null,null,""]
[null,"2016-02-22",13.8,4.2,-1,11.4,null,"",null,null,null,""]
[null,"2016-02-23",13.7,7.1,0.2,9.6999999999999993,null,"",null,null,null,""]
[null,"2016-02-24",9.8000000000000007,0.5,1.5,3.7,null,"",null,null,null,""]
[null,"2016-02-25",8.6999999999999993,-1.1000000000000001,-1,5.6,null,"",null,null,null,""]
[null,"2016-02-26",6.9,0.5,0.6,2,null,"",null,null,null,""]
[null,"2016-02-27",5.2,-3.2,0.2,2.2000000000000002,null,"",null,null,null,""]
[null,"2016-02-28",7.1,1,0.3,4.8,null,"",null,null,null,""]
[null,"2016-02-29",8.6999999999999993,4.4000000000000004,9,6.5,null,"",null,null,null,""]
[null,"2016-03-01",11.8,3.4,7.9,5.9,null,"",null,null,null,""]
[null,"2016-03-02",13.5,-1.8,-1,5,null,"",null,null,null,""]
[null,"2016-03-03",4.9000000000000004,0.1,10.9,2.2000000000000002,null,"",null,null,null,""]
[null,"2016-03-04",9.4,2,19.100000000000001,4.5999999999999996,null,"",null,null,null,""]
[null,"2016-03-05",12.7,-0.6,-1,9.1,null,{"$f":"IF(C68-D68<0, \"MINT > MAXT --> NAPAKA!!!!\",\"\")","v":""},null,null,null,""]
[null,"2016-03-06",11.4,3,4.8,6.5,null,"",null,null,null,{"$f":"IF(AND(F69>D69,F69<C69),\"\",\"NAPAKA. KER NE VELJA TMIN<TPOV<TMAX\")","v":""}]
[null,"2016-03-07",5.8,0.5,8.5,2.4,null,"",null,null,null,""]
[null,"2016-03-08",7.7,1.9,4.8,4.9000000000000004,null,"",null,null,null,""]
[null,"2016-03-09",6.8,3.1,-1,4.5,null,"",null,null,null,""]
[null,"2016-03-10",14.1,2.9,-1,6.2,null,"",null,null,null,""]
[null,"2016-03-11",9.4,3.2,0.3,7,null,"",null,null,null,""]
[null,"2016-03-12",7.3,4.9000000000000004,1,6.8,null,"",null,null,null,""]
[null,"2016-03-13",7.4,4.4000000000000004,-1,5.4,null,"",null,null,null,""]
[null,"2016-03-14",11.2,0.6,0.1,4.3,null,"",null,null,null,""]
[null,"2016-03-15",5.2,-3.5,-1,1.3,null,"",null,null,null,""]
[null,"2016-03-16",4.7,-1.1000000000000001,1.2,2.9,null,"",null,null,null,""]
[null,"2016-03-17",12.5,-1.5,-1,3.3,null,"",null,null,null,""]
{"$rows_left_out":296}